{"text_format":"1","workbook":"xlsx","n_sheets":6,"sheets":["Instrukcja","JPK","PKPIR","Zest_roczne","G","A"],"not_rendered":{"charts":0,"images":46,"macros":1,"external_links":0,"defined_names":4,"comments":0,"pivot_tables":0},"unopened":[],"bounds":{"document_bytes":16777216,"sheet_cells":100000,"rows_first":2000,"rows_last":500,"rows_between":2000,"halvings":0,"cell_chars":16384,"cell_head_chars":4096},"cells_cut":0,"cells_raw":0,"read":"whole","date_system":"1900"}

{"sheet":"Instrukcja","index":0,"n_rows":174,"n_cols":19,"rows_kept":174,"cut":false,"hidden":false,"merged":[[112,14,112,15],[112,16,112,17],[112,18,112,19],[113,6,113,13],[112,6,112,7],[112,8,112,9],[112,10,112,11],[112,12,112,13],[64,0,64,2],[0,1,0,11],[15,3,17,3],[19,3,21,3],[49,3,51,3],[54,3,56,3]]}
[null,"Instrukcja obsługi programu do JPK_PKPIR(3)"]
[]
[null,"Program służy do wygenerowania pliku w formacie XML zawierającego dane o środkach trwałych i wartościach"]
[null,"niematerialnych i prawnych, który przesyłany jest do urzędu skarbowego."]
[]
[]
[]
[]
[]
[]
[]
[]
[]
[]
[]
[null,null,null,"-","Ten przycisk służy do zaimportowania danych z innego pliku JPK_PKPIR(3)"]
[null,null,null,null,"utworzonego w innym okresie rozliczeniowym lub w innym programie."]
[null,null,null,null,"Można importować więcej plików, dane z których zostaną dopisane w Ewidencji (scalanie)."]
[]
[null,null,null,"-","Po przygotowaniu kompletnych danych tym przyciskiem utworzysz plik XML"]
[null,null,null,null,"w formacie wymaganym przez urząd skarbowy. Przed utworzeniem pliku XML"]
[null,null,null,null,"uruchamiana jest procedura sprawdzania kompletności wprowadzonych danych."]
[null,"Wypełnij wszystkie wymagane pola na arkuszu JPK"]
[null,"Urząd skarbowy znajdziesz wpisując fragment nazwy."]
[]
[]
[]
[]
[]
[]
[]
[]
[null,"Znaczenie przycisków"]
[]
[]
[]
[]
[]
[null,null,null,"-",null,"zaznacz komórkę i kliknij Wstaw wiersz co utworzy nad nią pusty wiersz. Kliknięcie Usuń wiersz usunie zaznaczony wiersz."]
[]
{"$rows_left_out":135}
{"sheet":"JPK","index":1,"n_rows":145,"n_cols":29,"rows_kept":145,"cut":false,"hidden":false,"merged":[[51,4,51,12],[47,4,47,12],[59,10,59,23],[51,13,51,23],[56,2,56,23],[55,3,55,18],[48,13,48,23],[55,19,55,23],[52,4,52,12],[52,13,52,23],[53,4,53,12],[53,13,53,23],[49,13,49,23],[0,0,0,12],[0,13,0,24],[8,12,8,20],[22,2,22,23],[13,4,13,9],[14,4,14,9],[13,10,13,16],[2,1,2,24],[19,3,19,23],[16,2,16,23],[11,2,11,23],[15,10,15,16],[15,17,15,19],[15,2,15,3],[15,4,15,9],[14,10,14,16],[15,20,15,23],[17,3,17,23],[20,10,20,16],[20,17,20,23],[8,2,8,11],[6,2,6,23],[13,2,14,3],[7,12,7,13],[29,3,29,10],[29,11,29,16],[29,17,29,23],[30,3,30,12],[30,13,30,23],[18,3,18,23],[21,2,21,23],[1,0,1,12],[1,13,1,24],[10,2,10,24],[20,4,20,7],[26,3,26,23],[27,3,27,23],[28,3,28,23],[24,3,24,23],[25,7,25,13],[25,15,25,23],[23,2,23,23],[3,1,3,24],[4,2,4,23],[5,2,5,23],[7,21,7,23],[8,21,8,23],[7,2,7,11],[7,14,7,20],[12,2,12,3],[9,2,9,7],[9,8,9,23],[12,4,12,16],[12,17,12,19],[12,20,12,23],[70,1,70,24],[61,2,61,18],[38,3,38,18],[39,3,39,18],[40,3,40,18],[42,3,42,18],[38,19,38,23],[39,19,39,23],[40,19,40,23],[42,19,42,23],[41,3,41,18],[41,19,41,23],[61,19,61,22],[46,13,46,23],[48,4,48,12],[54,4,54,12],[49,4,49,12],[63,1,63,24],[50,4,50,12],[50,13,50,23],[54,13,54,23],[47,13,47,23],[31,3,31,12],[31,13,31,23],[32,2,32,23],[33,2,33,23],[34,3,34,23],[35,15,35,23],[37,2,37,23],[36,2,36,23],[58,3,58,9],[59,3,59,9],[43,13,43,23],[43,3,43,12],[44,4,44,12],[44,13,44,23],[45,4,45,12],[45,13,45,23],[46,4,46,12],[58,10,58,23],[57,2,57,23]]}
[null,null,null,null,null,null,null,null,null,null,null,null,null,null,null,null,null,null,null,null,null,null,null,null,null,null,1,1,"K_1"]
["Uruchamianie przycisków i opcji wymaga włączenia makro",null,null,null,null,null,null,null,null,null,null,null,null,"INSTRUKCJA",null,null,null,null,null,null,null,null,null,null,null,null,1,2,"K_2"]
[null,null,null,null,null,null,null,null,null,null,null,null,null,null,null,null,null,null,null,null,null,null,null,null,null,null,0,3,"K_3A"]
[null,null,null,null,null,null,null,null,null,null,null,null,null,null,null,null,null,null,null,null,null,null,null,null,null,null,null,4,"K_3B"]
[null,null,"  POLA JASNE WYPEŁNIA PODATNIK, WYPEŁNIĆ KOMPUTEROWO DUŻYMI LITERAMI",null,null,null,null,null,null,null,null,null,null,null,null,null,null,null,null,null,null,null,null,null,null,null,null,5,"K_4A"]
[null,null,"                 Składanie JPK wyłącznie w wersji elektronicznej",null,null,null,null,null,null,null,null,null,null,null,null,null,null,null,null,null,null,null,null,null,null,null,null,6,"K_4B"]
[null,null,null,null,null,null,null,null,null,null,null,null,null,null,null,null,null,null,null,null,null,null,null,null,null,null,null,7,"K_5A"]
[null,null," 1. Numer Identyfikacji Podatkowej",null,null,null,null,null,null,null,null,null," 2. Nr dokumentu",null,null,null,null,null,null,null,null," 3. Status",null,null,null,null,null,8,"K_5B"]
[null,null,null,null,null,null,null,null,null,null,null,null,null,null,null,null,null,null,null,null,null,null,null,null,null,null,null,9,"K_6"]
[null,null,"  JPK_PKPIR(3)",null,null,null,null,null,null,null,null,null,null,null,null,null,null,null,null,null,null,null,null,null,null,null,null,10,"K_7"]
[null,null,"WERSJA DEMONSTRACYJNA",null,null,null,null,null,null,null,null,null,null,null,null,null,null,null,null,null,null,null,null,null,null,null,null,11,"K_8"]
[null,null,"JEDNOLITY PLIK KONTROLNY\nDLA PODATKOWEJ KSIĘGI PRZYCHODÓW I ROZCHODÓW",null,null,null,null,null,null,null,null,null,null,null,null,null,null,null,null,null,null,null,null,null,null,null,null,12,"K_9"]
[null,null,null,null,"za okres",null,null,null,null,null,null,null,null,null,null,null,null,null,null,null,null,null,null,null,null,null,null,13,"K_10"]
[null,null,null,null," 4. Od (dzień - miesiąc - rok)",null,null,null,null,null," 5. Do (dzień - miesiąc - rok)",null,null,null,null,null,null,null,null,null,null,null,null,null,null,null,null,14,"K_11"]
[null,null,null,null,1012026,null,null,null,null,null,31122026,null,null,null,null,null,null,null,null,null,null,null,null,null,null,null,null,15,"K_12"]
[null,null,null,null,null,null,null,null,null,null,null,null,null,null,null,null,null,null,null,null,null,null,null,null,null,null,null,16,"K_13"]
[null,null," A. MIEJSCE I CEL SKŁADANIA JPK",null,null,null,null,null,null,null,null,null,null,null,null,null,null,null,null,null,null,null,null,null,null,null,null,17,"K_14"]
[null,null,null," 6. Urząd skarbowy, do którego adresowany jest JPK",null,null,null,null,null,null,null,null,null,null,null,null,null,null,null,null,null,null,null,null,null,null,null,18,"K_15"]
[null,null,null,null,null,null,null,null,null,null,null,null,null,null,null,null,null,null,null,null,null,null,null,null,null,null,{"$f":"VLOOKUP(D19,G!I1:J400,2,FALSE)","v":{"$error":"#N/A"}},19,"K_16A"]
[null,null,null," 7. Cel złożenia  (zaznaczyć właściwy kwadrat):",null,null,null,null,null,null,null,null,null,null,null,null,null,null,null,null,null,null,null,null,null,null,null,20,"K_16B"]
[null,null,null,null,"1. złożenie JPK na żądanie",null,null,null,null,null," 2. złożenie JPK po raz pierwszy",null,null,null,null,null,null,"3. Złożenie korekty JPK",null,null,null,null,null,null,null,null,null,21,"K_17"]
[]
[null,null," B. DANE PODMIOTU"]
[null,null," B.1. DANE IDENTYFIKACYJNE"]
[null,null,null," 8. Rodzaj podmiotu (zaznaczyć właściwy kwadrat):"]
[null,null,null,null,null,null,null," 1. podmiot niebędący osobą fizyczną",null,null,null,null,null,null,null," 2. osoba fizyczna"]
[null,null,null," 9. Nazwa pełna podmiotu niebędącego osobą fizyczną"]
[]
[null,null,null," 10. Nazwisko i Imię pierwsze oraz data urodzenia osoby fizycznej"]
[]
[null,null,null," 11. Adres email (nieobowiązkowe)",null,null,null,null,null,null,null,null,null," 12. Numer telefonu (nieobowiązkowe)"]
[]
[]
[null,null," C. ZNACZNIK DLA PODATNIKA ROZLICZAJĄCEGO PODATEK METODĄ KASOWĄ"]
[null,null,null," 13. Kasowy PIT"]
[null,null,null,null,null,null,null,null,null,null,null,null,null,"1. tak"]
[]
[null,null," D. PODATKOWA KSIĘGA PRZYCHODÓW I ROZCHODÓW"]
[null,null,null," 14. Wartość spisu z natury na początek roku podatkowego"]
[null,null,null," 15. Wartość spisu z natury na koniec roku podatkowego"]
{"$rows_left_out":106}
{"sheet":"PKPIR","index":2,"n_rows":3,"n_cols":24,"rows_kept":3,"cut":false,"hidden":false,"merged":[]}
["Lp.\n\n\n","\n\nData zdarzenia gospodar\nczego","\nNr dowodu księgowego","Numer identyfikujący fakturę wystawioną przy użyciu Krajowego Systemu e-Faktur (numer KSeF)","Kod kraju nadania identyfikatora podatko\nwego","Numer identyfikacji podatkowej kontrahenta","\nKontrahent - imię i nazwisko (firma)","\nKontrahent- adres","\nOpis zdarzenia gospodarczego","Przychód - wartość sprzedanych towarów i usług","Przychód - pozostałe przychody","Przychód - razem przychód","Zakup towarów handlowych i materiałów wg cen zakupu","Koszty uboczne zakupu ","Wydatki (koszty) - wynagrodzenia w gotówce i w naturze","Wydatki (koszty) - pozostałe wydatki","Wydatki (koszty) - razem wydatki (12+13)","Wydatki (koszty) - pole wolne w PLN","Koszty działalności badawczo-rozwojowej, o których mowa w art. 26e ustawy o podatku dochodowym - opis kosztu","Koszty działalności badawczo-rozwojowej, o których mowa w art. 26e ustawy o podatku dochodowym ","\nUwagi\n\n\n",null,null,0]
[{"$f":"COUNTA(A4:A1048576)","v":0},null,null,null,null,null,null,null,null,{"$f":"SUM(J4:J1048576)","v":0},0,0,0,0,0,0,0,0,null,{"$f":"SUM(T4:T1048576)","v":0}]
["K_1","K_2","K_3A","K_3B","K_4A","K_4B","K_5A","K_5B","K_6","K_7","K_8","K_9","K_10","K_11","K_12","K_13","K_14","K_15","K_16A","K_16B","K_17"]

{"sheet":"Zest_roczne","index":3,"n_rows":130,"n_cols":24,"rows_kept":130,"cut":false,"hidden":false,"merged":[[59,5,59,8],[3,1,3,12],[4,1,4,12],[6,1,9,1],[6,2,9,2],[51,1,51,12],[52,1,52,12],[53,1,53,12],[54,1,54,12],[55,1,55,12],[71,5,71,8],[60,5,60,8],[61,5,61,8],[62,5,62,8],[63,5,63,8],[64,5,64,8],[65,5,65,8],[66,5,66,8],[67,5,67,8],[68,5,68,8],[69,5,69,8],[70,5,70,8],[83,5,83,8],[72,5,72,8],[73,5,73,8],[74,5,74,8],[75,5,75,8],[76,5,76,8],[77,5,77,8],[78,5,78,8],[79,5,79,8],[80,5,80,8],[81,5,81,8],[82,5,82,8],[91,2,91,10],[129,2,129,10],[84,5,84,8],[85,5,85,8],[86,5,86,8],[87,5,87,8],[88,5,88,8]]}
[]
[]
[]
[null,"Zestawienie roczne"]
[null,{"$f":"\"rok \"&RIGHT(JPK!K15,4)","v":"rok 2026"}]
[]
[null,"Lp.","Miesiąc",null,"Przychód",null,"Zakup tow.","Koszty","","     Wydatki (koszty)",null,null,"Koszty"]
[null,null,null,"wartość","pozostałe","razem","handlowych","uboczne","wynagrodzenia","pozostałe","razem",null,"działalności"]
[null,null,null,"sprzedanych","przychody","przychód","i materiałów","zakupu","w gotówce","wydatki","wydatki",null,"badawczo-"]
[null,null,null,"towarów i usł."," ","(7+8)","wg cen zak.",null,"i w naturze",null,"(12+13)",null,"rozwojowej"]
[null,null,null,"9","10","11","12","13","14","15","16","17","18"]
[null,1,"styczeń"]
[null,2,"luty"]
[null,3,"marzec"]
[null,4,"kwiecień"]
[null,5,"maj"]
[null,6,"czerwiec"]
[null,7,"lipiec"]
[null,8,"sierpień"]
[null,9,"wrzesień"]
[null,10,"październik"]
[null,11,"listopad"]
[null,12,"grudzień"]
[null," ","Razem      ",{"$f":"SUM(D12:D23)","v":0},0,0,0,0,0,0,0,0,0]
[]
[]
[null,null,null,null,null,null,null,{"$f":"\"Obliczenie dochodu za \"&RIGHT(JPK!K15,4)&\" r.\"","v":"Obliczenie dochodu za 2026 r."},null,null,null,"dochód w trakcie roku"]
[null,null,null,null,null,null,null,null,null,null,null,null,"Styczeń","Luty","Marzec","Kwiecień","Maj","Czerwiec","Lipiec","Sierpień","Wrzesień","Październik","Listopad","Grudzień"]
[null,null,null,"1.","Przychód netto (kol. 11)",null,null,null,null,{"$f":"F24","v":0},null,"narastająco",{"$f":"F12","v":0},{"$f":"SUM($F$12:$F13)","v":0},{"$f":"SUM($F$12:$F14)","v":0},{"$f":"SUM($F$12:$F15)","v":0},{"$f":"SUM($F$12:$F16)","v":0},{"$f":"SUM($F$12:$F17)","v":0},{"$f":"SUM($F$12:$F18)","v":0},{"$f":"SUM($F$12:$F19)","v":0},{"$f":"SUM($F$12:$F20)","v":0},{"$f":"SUM($F$12:$F21)","v":0},{"$f":"SUM($F$12:$F22)","v":0},{"$f":"SUM($F$12:$F23)","v":0}]
[]
[null,null,null,"2.","Wysokość kosztów uzyskania poniesionych w roku podatkowym:"]
[]
[null,null,null,null,"a) wartość spisu z natury na początek roku podatkowego",null,null,null,null,{"$f":"JPK!T39","v":0},null,"wpisz remanent początkowy",null,{"$f":"M33","v":0},{"$f":"N33","v":0},0,0,0,0,0,0,0,0,0]
[null,null,null,null,"b) plus wydatki na zakup towarów handlowych i materiałów (kol. 12)",null,null,null,null,{"$f":"G24","v":0},null,null,{"$f":"G12","v":0},{"$f":"SUM($G$12:$G13)","v":0},{"$f":"SUM($G$12:$G14)","v":0},{"$f":"SUM($G$12:$G15)","v":0},{"$f":"SUM($G$12:$G16)","v":0},{"$f":"SUM($G$12:$G17)","v":0},{"$f":"SUM($G$12:$G18)","v":0},{"$f":"SUM($G$12:$G19)","v":0},{"$f":"SUM($G$12:$G20)","v":0},{"$f":"SUM($G$12:$G21)","v":0},{"$f":"SUM($G$12:$G22)","v":0},{"$f":"SUM($G$12:$G23)","v":0}]
[null,null,null,null,"c) plus wydatki na koszty uboczne zakupu ( kol.13)",null,null,null,null,{"$f":"H24","v":0},null,null,{"$f":"H12","v":0},{"$f":"SUM($H$12:$H13)","v":0},{"$f":"SUM($H$12:$H14)","v":0},{"$f":"SUM($H$12:$H15)","v":0},{"$f":"SUM($H$12:$H16)","v":0},{"$f":"SUM($H$12:$H17)","v":0},{"$f":"SUM($H$12:$H18)","v":0},{"$f":"SUM($H$12:$H19)","v":0},{"$f":"SUM($H$12:$H20)","v":0},{"$f":"SUM($H$12:$H21)","v":0},{"$f":"SUM($H$12:$H22)","v":0},{"$f":"SUM($H$12:$H23)","v":0}]
[null,null,null,null,"d) minus wartość spisu z natury na koniec roku podatkowego",null,null,null,null,{"$f":"JPK!T40","v":0},null,"wpisz remanent okresowy ",null,{"$f":"M36","v":0},{"$f":"N36","v":0},0,0,0,0,0,0,0,0,0]
[null,null,null,null,"e) plus kwota pozostałych wydatków ( kol. 16)",null,null,null,null,{"$f":"K24","v":0},null,null,{"$f":"K12","v":0},{"$f":"SUM($K$12:$K13)","v":0},{"$f":"SUM($K$12:$K14)","v":0},{"$f":"SUM($K$12:$K15)","v":0},{"$f":"SUM($K$12:$K16)","v":0},{"$f":"SUM($K$12:$K17)","v":0},{"$f":"SUM($K$12:$K18)","v":0},{"$f":"SUM($K$12:$K19)","v":0},{"$f":"SUM($K$12:$K20)","v":0},{"$f":"SUM($K$12:$K21)","v":0},{"$f":"SUM($K$12:$K22)","v":0},{"$f":"SUM($K$12:$K23)","v":0}]
[null,null,null,null,"f) minus wartość wynagrodzeń w naturze ujętych w innych kol. księgi",null,null,null,null,null,null,"narastająco",null,{"$f":"M38","v":0},{"$f":"N38","v":0},{"$f":"O38","v":0},0,0,0,0,0,0,0,0]
[]
[null,null,null,null,"Razem koszty uzyskania przychodu",null,null,null,null,{"$f":"J33+J34+J35-J36+J37-J38","v":0},null,"narastająco",{"$f":"M33+M34+M35-M36+M37-M38","v":0},{"$f":"N33+N34+N35-N36+N37-N38","v":0},0,0,0,0,0,0,0,0,0,0]
{"$rows_left_out":91}
{"sheet":"G","index":4,"n_rows":400,"n_cols":18,"rows_kept":400,"cut":false,"hidden":true,"merged":[]}
[null,null,null,null,null,"PL",null,null,"URZĄD SKARBOWY W ALEKSANDROWIE KUJAWSKIM","0402","URZĄD SKARBOWY W ALEKSANDROWIE KUJAWSKIM"]
[null,null,null,null,null,"AF",null,null,"URZĄD SKARBOWY W AUGUSTOWIE","2002","URZĄD SKARBOWY W AUGUSTOWIE"]
[null,null,null,null,null,"AX",null,null,"URZĄD SKARBOWY W BARTOSZYCACH","2802","URZĄD SKARBOWY W BARTOSZYCACH"]
[null,null,null,null,null,"AL",null,null,"URZĄD SKARBOWY W BEŁCHATOWIE","1002","URZĄD SKARBOWY W BEŁCHATOWIE"]
[null,null,null,null,null,"DZ",null,null,"URZĄD SKARBOWY W BĘDZINIE","2402","URZĄD SKARBOWY W BĘDZINIE"]
[null,null,null,null,null,"AD",null,null,"URZĄD SKARBOWY W BIAŁEJ PODLASKIEJ","0602","URZĄD SKARBOWY W BIAŁEJ PODLASKIEJ"]
[null,null,null,null,null,"AO",null,null,"URZĄD SKARBOWY W BIAŁOBRZEGACH","1402","URZĄD SKARBOWY W BIAŁOBRZEGACH"]
[null,null,null,null,null,"AI",null,null,"URZĄD SKARBOWY W BIAŁOGARDZIE","3202","URZĄD SKARBOWY W BIAŁOGARDZIE",null,null,null,null,null,"pow","=PRZESUNIĘCIE(G!$D$1;PODAJ.POZYCJĘ(WYSZUKAJ.PIONOWO(@;G!G$1:H$16;2);G!$D:$D;0)-1;1;LICZ.JEŻELI(G!$D:$D;WYSZUKAJ.PIONOWO(@;G!G$1:H$16;2));1)"]
[null,null,null,null,null,"AQ",null,null,"PIERWSZY URZĄD SKARBOWY W BIAŁYMSTOKU","2003","PIERWSZY URZĄD SKARBOWY W BIAŁYMSTOKU",null,null,null,null,null,"gmi","=PRZESUNIĘCIE(G!$A$1;PODAJ.POZYCJĘ(WYSZUKAJ.PIONOWO(#;G!E$2:F$380;2;FAŁSZ);G!$A:$A;0)-1;1;LICZ.JEŻELI(G!$A:$A;WYSZUKAJ.PIONOWO(#;G!E$2:F$380;2;FAŁSZ));1)"]
[null,null,null,null,null,"AG",null,null,"DRUGI URZĄD SKARBOWY W BIAŁYMSTOKU","2004","DRUGI URZĄD SKARBOWY W BIAŁYMSTOKU",null,null,null,null,null,null,"@ - pow"]
[null,null,null,null,null,"AN",null,null,"URZĄD SKARBOWY W BIELSKU PODLASKIM","2005","URZĄD SKARBOWY W BIELSKU PODLASKIM",null,null,null,null,null,null,"# - gmi"]
[null,null,null,null,null,"SA",null,null,"PIERWSZY URZĄD SKARBOWY W BIELSKU-BIAŁEJ","2403","PIERWSZY URZĄD SKARBOWY W BIELSKU-BIAŁEJ"]
[null,null,null,null,null,"AR",null,null,"DRUGI URZĄD SKARBOWY W BIELSKU-BIAŁEJ","2404","DRUGI URZĄD SKARBOWY W BIELSKU-BIAŁEJ"]
[null,null,null,null,null,"AM",null,null,"DRUGI ŚLĄSKI URZĄD SKARBOWY W BIELSKU-BIAŁEJ","2472","URZĄD SKARBOWY W BIŁGORAJU"]
[null,null,null,null,null,"AW",null,null,"URZĄD SKARBOWY W BIŁGORAJU","0603","URZĄD SKARBOWY W BOCHNI"]
[null,null,null,null,null,"AU",null,null,"URZĄD SKARBOWY W BOCHNI","1202","URZĄD SKARBOWY W BOLESŁAWCU"]
[null,null,null,null,null,"AT",null,null,"URZĄD SKARBOWY W BOLESŁAWCU","0202","URZĄD SKARBOWY W BRANIEWIE"]
[null,null,null,null,null,"AZ",null,null,"URZĄD SKARBOWY W BRANIEWIE","2803","URZĄD SKARBOWY W BRODNICY"]
[null,null,null,null,null,"BS",null,null,"URZĄD SKARBOWY W BRODNICY","0403","URZĄD SKARBOWY W BRZEGU"]
[null,null,null,null,null,"BH",null,null,"URZĄD SKARBOWY W BRZEGU","1602","URZĄD SKARBOWY W BRZESKU"]
[null,null,null,null,null,"BD",null,null,"URZĄD SKARBOWY W BRZESKU","1203","URZĄD SKARBOWY W BRZEZINACH"]
[null,null,null,null,null,"BB",null,null,"URZĄD SKARBOWY W BRZEZINACH","1003","URZĄD SKARBOWY W BRZOZOWIE"]
[null,null,null,null,null,"BE",null,null,"URZĄD SKARBOWY W BRZOZOWIE","1802","URZĄD SKARBOWY W BUSKU-ZDROJU"]
[null,null,null,null,null,"BZ",null,null,"URZĄD SKARBOWY W BUSKU-ZDROJU","2602","PIERWSZY URZĄD SKARBOWY W BYDGOSZCZY"]
[null,null,null,null,null,"BJ",null,null,"PIERWSZY URZĄD SKARBOWY W BYDGOSZCZY","0404","DRUGI URZĄD SKARBOWY W BYDGOSZCZY"]
[null,null,null,null,null,"BM",null,null,"DRUGI URZĄD SKARBOWY W BYDGOSZCZY","0405","TRZECI URZĄD SKARBOWY W BYDGOSZCZY"]
[null,null,null,null,null,"BT",null,null,"TRZECI URZĄD SKARBOWY W BYDGOSZCZY","0406","URZĄD SKARBOWY W BYSTRZYCY KŁODZKIEJ"]
[null,null,null,null,null,"BY",null,null,"KUJAWSKO-POMORSKI URZĄD SKARBOWY W BYDGOSZCZY","0471","URZĄD SKARBOWY W BYTOMIU"]
[null,null,null,null,null,"BO",null,null,"URZĄD SKARBOWY W BYSTRZYCY KŁODZKIEJ","0203","URZĄD SKARBOWY W BYTOWIE"]
[null,null,null,null,null,"BQ",null,null,"URZĄD SKARBOWY W BYTOMIU","2405","URZĄD SKARBOWY W CHEŁMIE"]
[null,null,null,null,null,"BA",null,null,"URZĄD SKARBOWY W BYTOWIE","2202","URZĄD SKARBOWY W CHEŁMNIE"]
[null,null,null,null,null,"BW",null,null,"URZĄD SKARBOWY W CHEŁMIE","0604","URZĄD SKARBOWY W CHODZIEŻY"]
[null,null,null,null,null,"BR",null,null,"URZĄD SKARBOWY W CHEŁMNIE","0407","URZĄD SKARBOWY W CHOJNICACH"]
[null,null,null,null,null,"BN",null,null,"URZĄD SKARBOWY W CHODZIEŻY","3037","URZĄD SKARBOWY W CHORZOWIE"]
[null,null,null,null,null,"IO",null,null,"URZĄD SKARBOWY W CHOJNICACH","2203","URZĄD SKARBOWY W CHOSZCZNIE"]
[null,null,null,null,null,"BG",null,null,"URZĄD SKARBOWY W CHORZOWIE","2406","URZĄD SKARBOWY W CHRZANOWIE"]
[null,null,null,null,null,"BF",null,null,"URZĄD SKARBOWY W CHOSZCZNIE","3203","URZĄD SKARBOWY W CIECHANOWIE"]
[null,null,null,null,null,"BI",null,null,"URZĄD SKARBOWY W CHRZANOWIE","1204","URZĄD SKARBOWY W CIESZYNIE"]
[null,null,null,null,null,"XC",null,null,"URZĄD SKARBOWY W CIECHANOWIE","1403","URZĄD SKARBOWY W CZARNKOWIE"]
[null,null,null,null,null,"CL",null,null,"URZĄD SKARBOWY W CIESZYNIE","2407","URZĄD SKARBOWY W CZECHOWICACH-DZIEDZICACH"]
{"$rows_left_out":361}
{"sheet":"A","index":5,"n_rows":5,"n_cols":4,"rows_kept":5,"cut":false,"hidden":true,"merged":[]}
[]
[null,{"$f":"\"Liczba danych do zapisu w pliku XML przekracza\nlimit \"&B1&\" pozycji określony dla tej wersji programu.\nZapis danych XML został zatrzymany.\nJeżeli potrzebny jest większy limit prosimy o kontakt:\n            biuro@signform.pl tel. 608 43 63 83\"","v":"Liczba danych do zapisu w pliku XML przekracza\nlimit  pozycji określony dla tej wersji programu.\nZapis danych XML został zatrzymany.\nJeżeli potrzebny jest większy limit prosimy o kontakt:\n            biuro@signform.pl tel. 608 43 63 83"},null,0]
["2027-01-01","To jest wersja DEMONSTRACYJNA programu\nktóra do pliku XML zapisuje fikcyjne dane.\nJeżeli program  jest potrzebny prosimy o kontakt:\n            biuro@signform.pl tel. 608 43 63 83\"","To jest wersja DEMONSTRACYJNA programu.\nJeżeli program  jest potrzebny prosimy o kontakt:\n            biuro@signform.pl tel. 608 43 63 83\""]
[{"$f":"\"Licencja programu wygasła \"&TEXT(A1,\"dd-mm-rrrr\") &\"\nJeżeli potrzebne jest przedłużenie prosimy o kontakt:\n            biuro@signform.pl tel. 608 43 63 83\"","v":"Licencja programu wygasła 00-01-1900\nJeżeli potrzebne jest przedłużenie prosimy o kontakt:\n            biuro@signform.pl tel. 608 43 63 83"},{"$f":"\"Brak licencji dla Nr \" & JPK!C9 &\" Prosimy o podanie NIP używanego w programie mailem biuro@signform.pl lub telefonicznie 608 43 63 83\"","v":"Brak licencji dla Nr  Prosimy o podanie NIP używanego w programie mailem biuro@signform.pl lub telefonicznie 608 43 63 83"}]
[" WERSJA DEMONSTRACYJNA","biuro@signform.pl tel. 608 43 63 83"]